Jump to content

SUBIECTE NOI
« 1 / 5 »
RSS
Chevrolet Captiva - ce parere ave...

Temperatura AMD FX-6100 Hexa Core

problema laptop hp pavilion g7 wi...

senzor de prezenta
 Harta Orasului Otopeni

Grupul V.A.G.

Universal Serial Bus (USB) Contro...

Dimensionare radiator TDA 2030
 Problema instalare windows 7.

Fiat Grande Punto 1.3 Multijet 2008

Uttorent-ul blocheaza tot traficu...

Cum schimbi un bec
 Prin Bucuresti

Veniturile din chirii si mai mult...

Eroare XML sitemap - wordpress

Se descarca script proxy problema
 
Forumul Softpedia folosește "cookies" pentru a oferi utilizatorilor o experiență completă. Vezi detalii sau închide mesaj (x)

probleme drivere in debian

  • Please log in to reply
No replies to this topic

#1
mithnick

mithnick

    Junior

  • Grup: Members
  • Posts: 269
  • Înscris: 09.09.2007
  • ID membru: 224,319
  • Locație: Slatina

fratilor am incercat sa creez un modul nvidia pentru driverul video dar iata ce imi output imi da

Quote

osiris:/usr/src# cd /usr/src/modules/nvidia-kernel
osiris:/usr/src/modules/nvidia-kernel# debian/rules binary_modules
# select which makefile to use.
rm -f /usr/src/modules/nvidia-kernel/nv/Makefile || true
if [ 6 = 6  ]; then \
             cd /usr/src/modules/nvidia-kernel/nv ; \
             ln -s Makefile.kbuild Makefile ; \
             cd .. ; \
             if [ 0  = 1 ] ; then \
                dpatch apply 04_minion ; \
             fi ; \
             if [ 0 = 1 ]; then \
                dpatch apply 01_sysfs ; \
                dpatch status 01_sysfs >patch-stamp ; \
                dpatch apply 02_pcialias ; \
                dpatch status 02_pcialias >>patch-stamp ; \
             fi ; \
        fi
if [  6 = 4  ]; then \
             cd /usr/src/modules/nvidia-kernel/nv ; \
             ln -s Makefile.nvidia Makefile ; \
             cd .. ; \
        fi
#nothing here anymore
touch configure-stamp
if [ -f /usr/src/modules/nvidia-kernel/debian/control.template ]; then \
                cp  /usr/src/modules/nvidia-kernel/debian/control.template /usr/src/modules/nvidia-kernel/debian/control; \
        fi
dh_testdir
dh_testroot
PATCHLEVEL = 6
Kernel compiler version : 4.1.1
Detected compiler version : 4.1.1
Using compiler gcc-4.1 version 4.1.1
touch /usr/src/modules/nvidia-kernel/nv/gcc-check
touch /usr/src/modules/nvidia-kernel/nv/cc-sanity-check
## Main Make ##
IGNORE_CC_MISMATCH=1 CC="gcc-4.1"  /usr/bin/make -C /usr/src/modules/nvidia-kernel/nv -f Makefile SYSSRC=/usr/src/linux-headers-2.6.18-5-k7   KBUILD_PARAMS="-C /usr/src/linux-headers-2.6.18-5-k7 SUBDIRS=/usr/src/modules/nvidia-kernel/nv" module;
make[1]: Entering directory `/usr/src/modules/nvidia-kernel/nv'

NVIDIA: calling KBUILD...
make CC=gcc-4.1 -C /usr/src/linux-headers-2.6.18-5-k7 SUBDIRS=/usr/src/modules/nvidia-kernel/nv modules
make[2]: Entering directory `/usr/src/linux-headers-2.6.18-5-k7'
  CC [M]  /usr/src/modules/nvidia-kernel/nv/os-interface.o
In file included from include/linux/list.h:8,
                 from include/linux/lockdep.h:12,
                 from include/linux/spinlock_types.h:12,
                 from include/linux/spinlock.h:78,
                 from include/linux/capability.h:45,
                 from include/linux/sched.h:44,
                 from include/linux/module.h:9,
                 from /usr/src/modules/nvidia-kernel/nv/nv-linux.h:46,
                 from /usr/src/modules/nvidia-kernel/nv/os-interface.c:26:
include/linux/prefetch.h: In function ‘prefetch_rangee’:
include/linux/prefetch.h:62: warning: pointer of type ‘void **’ used in arithmetic
In file included from include/linux/dmapool.h:14,
                 from include/linux/pci.h:564,
                 from /usr/src/modules/nvidia-kernel/nv/nv-linux.h:69,
                 from /usr/src/modules/nvidia-kernel/nv/os-interface.c:26:
include/asm/io.h: In function ‘check_signaturee’:
include/asm/io.h:245: warning: wrong type argument to increment
In file included from /usr/src/modules/nvidia-kernel/nv/os-interface.c:26:
/usr/src/modules/nvidia-kernel/nv/nv-linux.h:241:5: warning: "NV_ENABLE_MEM_TRACKING" is not defined
/usr/src/modules/nvidia-kernel/nv/nv-linux.h:269:5: warning: "NV_ENABLE_MEM_TRACKING" is not defined
/usr/src/modules/nvidia-kernel/nv/nv-linux.h:691:2: warning: #warning "conftest.sh failed, assuming remap_page_range(4)!"
/usr/src/modules/nvidia-kernel/nv/os-interface.c:667:5: warning: "DEBUG" is not defined
/usr/src/modules/nvidia-kernel/nv/os-interface.c:679:5: warning: "DEBUG" is not defined
/usr/src/modules/nvidia-kernel/nv/os-interface.c: In function ‘os_set_mlock_capabilityy’:
/usr/src/modules/nvidia-kernel/nv/os-interface.c:1262: error: ‘struct task_structt’ has no member named ‘rlimm’
make[3]: *** [/usr/src/modules/nvidia-kernel/nv/os-interface.o] Error 1
make[2]: *** [_module_/usr/src/modules/nvidia-kernel/nv] Error 2
make[2]: Leaving directory `/usr/src/linux-headers-2.6.18-5-k7'
NVIDIA: left KBUILD.
nvidia.ko failed to build!
make[1]: *** [module] Error 1
make[1]: Leaving directory `/usr/src/modules/nvidia-kernel/nv'
make: *** [build-stamp] Error 2
.Ma ajuta si pe mine cinvea?ce se intampla?Rog adminu sa nu mute postul!

Reclamă


0 user(s) are reading this topic

0 members, 0 guests, 0 anonymous users